Tag: windows

virtualenv на windows устанавливается в пакеты системных сайтов

Я инициализирую свой проект с помощью virtualenv помощью этих шагов (в ОС Windows 7): $ cd myproject $ virtualenv venv $ venv\scripts\activate и затем я пытаюсь установить flask $ pip install Flask но я обнаружил, что /venv/lib/site-packages не установлен в /venv/lib/site-packages my /venv/lib/site-packages он по-прежнему устанавливается в моей папке C:/Python27/lib/site-packages Это верно? Я думаю, что […]

Ошибка авторизации кликов PyAutoGui

У меня очень странная проблема, которую я раньше не видел в python. У меня есть скрипт, который работает безупречно на одном ПК, и когда я пытаюсь использовать его на другом, моя определенная функция терпит неудачу. Я использую PyAutoGUI для автоматизации некоторых процессов. import csv import pyautogui pyautogui.PAUSE = 0.50 pyautogui.FAILSAFE = True #click function requires […]

Python Windows CMD mklink, перестает работать без сообщения об ошибке

Я хочу создать символические ссылки для каждого файла в вложенной структуре каталогов, где все символические ссылки будут помещены в одну большую плоскую папку и теперь имеют следующий код: # loop over directory structure: # for all items in current directory, # if item is directory, recurse into it; # else it's a file, then create […]

Не удается запустить python в терминале git?

У меня есть python 3.6, установленный на моей системе Win7, и я пытаюсь заставить его работать в git bash (MINGW64), до сих пор безрезультатно. Я добавил каталог установки (НЕ, файл, конечно) в PATH, без каких-либо результатов. Даже если я напрямую cd к каталогу установки, он не видит его. $ python bash: python: command not found […]

pip install -U steem error Windows Kits

Я все еще пытаюсь установить steem через команду «pip install -U steem». Я уже сделал то, что предложил Дэвид в этом потоке Ошибка протокола: требуется Microsoft Visual C ++ 14.0 , что означает, что я установил пакет Microsoft Visual, который он связал, и снова запустил команду установки. Ошибка, которую я получаю сейчас, следующая: creating build\lib.win-amd64-3.6\Crypto\Cipher […]

Запуск командного файла в другом каталоге в python

Я хочу запустить файл mybat.bat расположенный в MyFolder, который отличается от текущего каталога. Я использовал следующий код: subprocess.Popen(["mybat", MyArg], cwd=MyFolder, stdout=subprocess.PIPE, stderr=subprocess.PIPE, stdin=subprocess.PIPE) Однако я получаю следующую ошибку: "WindowsError: [Error 2] The system cannot find the file specified" Я должен упомянуть, что если я заменю mybat другой программой в PATH, такой как notepad она работает […]

Какой терминал использует Python IDLE для Windows

Сегодня я помогал коллеге Stack Overflow-er, и я заметил, что я не знаю, что терминал IDLE использует в Windows. Я молчаливо предполагаю, что Python не писал собственный терминал для Windows и что они, вероятно, используют API, который дает им некоторую версию cmd или powershell . Я проверил, что интерпретатор работает на cmd , но я […]

Windows Logon как пользователь без пароля с Python

У меня здесь ситуация. Используя Python, я создал процесс (работает как SYSTEM или Administrator user), и мне нужно вызвать приложение, используя другое имя пользователя без пароля. Поэтому, читая эту ссылку ниже, вывод заключается в том, что это возможно, олицетворяя другого пользователя без пароля, используя Kerberos … но я не нахожу никакого решения, написанного на Python, […]

pip install – PermissionError: Разрешение отклонено

Окружающая среда Windows 8.1 Python 3.5 анаконда вопрос Когда я делаю pip install sklearn –upgrade , я получил следующую ошибку: Exception: Traceback (most recent call last): File "d:\anaconda3\lib\site-packages\pip\basecommand.py", line 209, in main status = self.run(options, args) File "d:\anaconda3\lib\site-packages\pip\commands\install.py", line 317, in run prefix=options.prefix_path, File "d:\anaconda3\lib\site-packages\pip\req\req_set.py", line 732, in install **kwargs File "d:\anaconda3\lib\site-packages\pip\req\req_install.py", line 835, in […]

Не удается найти lpython2.7

/usr/lib/gcc/x86_64-pc-cygwin/5.4.0/../../../../x86_64-pc-cygwin/bin/ld: не удается найти -lpython2.7 collect2: error: ld вернулся 1 статус выхода Я работаю над cygwin , пытаясь установить sentry и столкнулся с этой ошибкой? Может ли кто-нибудь сказать, почему я столкнулся с этой проблемой, проблема связана с пакетом python-dev ? Также как установить python-dev на cygwin, если потребуется?

 
Interesting Posts for Van-Lav

Журналы Heroku для проектов Django пропускают ошибки

Получить один контакт с python gdata.contacts.client

сравнение двух строк с «is» – не выполняется, как ожидалось

Перенести текущего пользователя в начальный для CreateView в Django

Как отобразить изображение и получить координату клика мыши на нем

Как использовать python для веб-разработки, не полагаясь на структуру?

Потребление памяти продукта itertools Python

Динамический порядок в django-mptt

Печать номеров с точки зрения технических единиц в Python

Как выполнить модульный тест в приложениях Autobahn с использованием Twisted Trial?

Эквивалент шаблонного контекста в Pyramid (пользователь pylons)

Вход в командную строку Python в процессе

Как обратиться к стандартной библиотеке в файле конфигурации ведения журнала?

Как удалить все версии python и использовать стандартную системную версию OS X 10.10?

Когда и как использовать встроенное свойство функции () в python

Python - лучший язык программирования в мире.