Установка Python3.4.3: 3 теста не удалось, 3 изменена среда исполнения и 25 пропущенных

Я использую Lubuntu 14.04 в качестве гостевой ОС (используя VMplayer). Я хотел установить python3.4.3. Я загрузил файл .tar.xz отсюда: https://www.python.org/downloads/

Затем я извлек файл и выполнил инструкции в README:

./configure make make test 

Когда я побежал

 make test 

он вернул это:

 359 tests OK. 3 tests failed: test_urllib test_urllib2 test_urllib2net 3 tests altered the execution environment: test___all__ test_site test_warnings 25 tests skipped: test_bz2 test_curses test_dbm_gnu test_dbm_ndbm test_devpoll test_gdb test_gzip test_idle test_kqueue test_lzma test_msilib test_ossaudiodev test_readline test_smtpnet test_sqlite test_ssl test_startfile test_tcl test_tk test_ttk_guionly test_ttk_textonly test_winreg test_winsound test_zipfile64 test_zlib Re-running failed tests in verbose mode Re-running test 'test_urllib' in verbose mode test test_urllib crashed -- Traceback (most recent call last): File "/home/ayman/Downloads/python3.4.3/Python-3.4.3/Lib/test/regrtest.py", line 1271, in runtest_inner the_module = importlib.import_module(abstest) File "/home/ayman/Downloads/python3.4.3/Python-3.4.3/Lib/importlib/__init__.py", line 109, in import_module return _bootstrap._gcd_import(name[level:], package, level) File "<frozen importlib._bootstrap>", line 2254, in _gcd_import File "<frozen importlib._bootstrap>", line 2237, in _find_and_load File "<frozen importlib._bootstrap>", line 2226, in _find_and_load_unlocked File "<frozen importlib._bootstrap>", line 1200, in _load_unlocked File "<frozen importlib._bootstrap>", line 1129, in _exec File "<frozen importlib._bootstrap>", line 1471, in exec_module File "<frozen importlib._bootstrap>", line 321, in _call_with_frames_removed File "/home/ayman/Downloads/python3.4.3/Python-3.4.3/Lib/test/test_urllib.py", line 13, in <module> import ssl File "/home/ayman/Downloads/python3.4.3/Python-3.4.3/Lib/ssl.py", line 97, in <module> import _ssl # if we can't import it, let the error propagate ImportError: No module named '_ssl' Re-running test 'test_urllib2' in verbose mode test test_urllib2 crashed -- Traceback (most recent call last): File "/home/ayman/Downloads/python3.4.3/Python-3.4.3/Lib/test/regrtest.py", line 1271, in runtest_inner the_module = importlib.import_module(abstest) File "/home/ayman/Downloads/python3.4.3/Python-3.4.3/Lib/importlib/__init__.py", line 109, in import_module return _bootstrap._gcd_import(name[level:], package, level) File "<frozen importlib._bootstrap>", line 2254, in _gcd_import File "<frozen importlib._bootstrap>", line 2237, in _find_and_load File "<frozen importlib._bootstrap>", line 2226, in _find_and_load_unlocked File "<frozen importlib._bootstrap>", line 1200, in _load_unlocked File "<frozen importlib._bootstrap>", line 1129, in _exec File "<frozen importlib._bootstrap>", line 1471, in exec_module File "<frozen importlib._bootstrap>", line 321, in _call_with_frames_removed File "/home/ayman/Downloads/python3.4.3/Python-3.4.3/Lib/test/test_urllib2.py", line 3, in <module> from test import test_urllib File "/home/ayman/Downloads/python3.4.3/Python-3.4.3/Lib/test/test_urllib.py", line 13, in <module> import ssl File "/home/ayman/Downloads/python3.4.3/Python-3.4.3/Lib/ssl.py", line 97, in <module> import _ssl # if we can't import it, let the error propagate ImportError: No module named '_ssl' Re-running test 'test_urllib2net' in verbose mode test test_urllib2net crashed -- Traceback (most recent call last): File "/home/ayman/Downloads/python3.4.3/Python-3.4.3/Lib/test/regrtest.py", line 1271, in runtest_inner the_module = importlib.import_module(abstest) File "/home/ayman/Downloads/python3.4.3/Python-3.4.3/Lib/importlib/__init__.py", line 109, in import_module return _bootstrap._gcd_import(name[level:], package, level) File "<frozen importlib._bootstrap>", line 2254, in _gcd_import File "<frozen importlib._bootstrap>", line 2237, in _find_and_load File "<frozen importlib._bootstrap>", line 2226, in _find_and_load_unlocked File "<frozen importlib._bootstrap>", line 1200, in _load_unlocked File "<frozen importlib._bootstrap>", line 1129, in _exec File "<frozen importlib._bootstrap>", line 1471, in exec_module File "<frozen importlib._bootstrap>", line 321, in _call_with_frames_removed File "/home/ayman/Downloads/python3.4.3/Python-3.4.3/Lib/test/test_urllib2net.py", line 3, in <module> from test.test_urllib2 import sanepathname2url File "/home/ayman/Downloads/python3.4.3/Python-3.4.3/Lib/test/test_urllib2.py", line 3, in <module> from test import test_urllib File "/home/ayman/Downloads/python3.4.3/Python-3.4.3/Lib/test/test_urllib.py", line 13, in <module> import ssl File "/home/ayman/Downloads/python3.4.3/Python-3.4.3/Lib/ssl.py", line 97, in <module> import _ssl # if we can't import it, let the error propagate ImportError: No module named '_ssl' make: *** [test] Error 1 

Я не уверен, что эти неудачные / пропущенные тесты влияют на меня в конечном итоге после установки Python3.4.3 с:

 sudo make install 

Должен ли я беспокоиться об этом неудачном / пропущенном тесте? Если да, то любая идея о том, как исправить эти проблемы?

One Solution collect form web for “Установка Python3.4.3: 3 теста не удалось, 3 изменена среда исполнения и 25 пропущенных”

Кажется, что вы компилировали Python без поддержки ssl или zlib. Вот почему некоторые тесты провалились, а некоторые пропущены.

Вы можете проверить, как скомпилировать Python 2.4.6 с помощью ssl, readline и zlib в Debian Lenny и нет модуля с именем zlib .

  • pip install MySQL-python не работает на ubuntu 14.04, ошибка: команда «x86_64-linux-gnu-gcc» не удалась с статусом выхода 1
  • Как отредактировать путь в odbcinst -j
  • Virtualenv - Python 3 - Ubuntu 14.04 64 бит
  • Не удалось запустить pip: UnicodeDecodeError
  • Что мне делать против версии CUDA драйвера недостаточно для версии исполнения CUDA?
  • Nginx не служит для изображения django
  • Ошибка во время syncdb django-mongo
  • Как решить проблему конфликта anaconda и virtualenv
  • установить HDF5 и pytables в ubuntu
  • Получение «django.core.exceptions.ImproperlyConfigured: GEOS требуется и не обнаружено». Хотя GEOS установлен
  • Что еще я могу сделать для устранения неполадок пакета, не импортирующего в python, но импорт в ipython, а в virtualenv?
  • Python - лучший язык программирования в мире.